{"text_format":"1","workbook":"xlsx","n_sheets":6,"sheets":["Portada","Instructivo","Resoluciones 2015","Lista Desplegable","cpr04","CONTROL DE CAMBIOS"],"not_rendered":{"charts":0,"images":4,"macros":0,"external_links":7,"defined_names":15,"comments":1,"pivot_tables":0},"unopened":[],"bounds":{"document_bytes":16777216,"sheet_cells":100000,"rows_first":2000,"rows_last":500,"rows_between":2000,"halvings":0,"cell_chars":16384,"cell_head_chars":4096},"cells_cut":0,"cells_raw":0,"read":"whole","date_system":"1900"}

{"sheet":"Portada","index":0,"n_rows":0,"n_cols":0,"rows_kept":0,"cut":false,"hidden":false,"merged":[]}

{"sheet":"Instructivo","index":1,"n_rows":15,"n_cols":2,"rows_kept":15,"cut":false,"hidden":false,"merged":[[0,0,0,1]]}
["INSTRUCTIVO NORMOGRAMA"]
["VARIABLES","INDICACIONES"]
["NORMOGRAMA","Es una herramienta que permite a las entidades públicas y privadas delimitar las reglas que regulan sus actuaciones en desarrollo con su objeto misional. El normograma contiene las reglas externas como leyes, decretos, acuerdos, circulares, resoluciones que afectan la gestión de la entidad y las normas internas como reglamentos, estatutos, manuales y, en general, todos los actos administrativos de interés para la entidad que permiten identificar las competencias, responsabilidades y funciones de las dependencias de la organización."]
["DEPENDENCIA ","Corresponde al área funcional y/o esctructural donde se identifica la obligación legal o normativa. Una vez seleccionado el proceso, esta información aparecerá automáticamente."]
["PROCESO","Se debe seleccionar el proceso de la entidad al que corresponde la regla."]
["TIPO DE NORMA","Tipología normativa del documento, entre las cuales se encuentran en la lista desplegable y predeterminada las siguientes que se identifican con la naturaleza de la regla: Constitución Politica, Ley, Decreto, Decreto Ley, Concepto, Acuerdo, Directiva, Documento CONPES, Reglamento, Ordenanza, Resolución, Norma, Guia y Circular. Se debe seleccionar a que tipo de norma corresponde."]
["FUENTE DE LA NORMA ","Fuente de la norma, entre las cuales se encuentran en la lista desplegable y predeterminada que se identifican con la competencia, la siguientes: Nacional, Regional, Departamental, Municipal, Distrital, Técnica, Interna e Internacional. Se debe seleccionar a que tipo de norma corresponde."]
["NÚMERO DE IDENTIFICACIÓN ","Consecutivo con el que se identifica la Regla dependiendo de su tipología "]
["TÍTULO DEL DOCUMENTO","Titulo por medio del cual se identifica el documento."]
["ENTIDAD QUE EXPIDE","Hace referencia a la entidad o persona que produce la regla. "]
["TEMA ESPECÍFICO","Tema que trata la norma, en correspondencia con los objetivos y alcance del proceso."]
["FECHA EXPEDICIÓN\n(DD/MM/AAAA)","Fecha en la cual se expide el documento. No se debe confundir con la fecha de entrada en vigencia."]
["ARTÍCULOS","Articulos especificos que establece la regla aplicable. "]
["ESTADO ","Entre las cuales se encuentran en la lista desplegable y predeterminada que se identifican con la vigencia la siguientes: a) Vigente; b) Perdida de fuerza de una parte de la norma, por ente competente y; c) Perdida de fuerza de la totalidad de la norma, por ente competente.  "]
["COMENTARIOS","Observaciones a la norma, por parte del responsable del proceso, el área de Control Interno, Oficina de Planeación Institucional, o cualquier otro actor involucrado en el proceso."]

{"sheet":"Resoluciones 2015","index":2,"n_rows":392,"n_cols":12,"rows_kept":392,"cut":false,"hidden":false,"merged":[[0,0,5,0],[6,0,6,11],[4,10,5,11],[5,7,5,9],[4,7,4,9],[2,1,2,9],[4,1,4,6],[5,1,5,6],[0,1,0,9],[0,10,0,11],[1,10,1,11],[2,10,2,11],[3,10,3,11],[1,1,1,9],[3,1,3,9]]}
[null,"TIPO DE DOCUMENTO:               ",null,null,null,null,null,null,null,null,"VERSIÓN No. "]
[null,"FORMATO",null,null,null,null,null,null,null,null,4]
[null,"PROCEDIMIENTO:           ",null,null,null,null,null,null,null,null,"VIGENTE A PARTIR DE:"]
[null,"ACTUALIZACIÓN NORMATIVA",null,null,null,null,null,null,null,null,"2019-04-09"]
[null,"TITULO: ",null,null,null,null,null,"CODIGO:",null,null,"Página 1 de 1"]
[null,"NORMOGRAMA",null,null,null,null,null,"F-GJ.03 - 01"]
["NORMOGRAMA "]
["DEPENDENCIA","PROCESO","TIPO DE NORMA","FUENTE DE LA NORMA","NÚMERO DE IDENTIFICACIÓN","TÍTULO DEL DOCUMENTO","ENTIDAD QUE EXPIDE","TEMA ESPECÍFICO","FECHA EXPEDICIÓN\n(DD/MM/AAAA)","ARTÍCULOS","ESTADO","COMENTARIOS"]
[{"$f":"IF(ISERROR(VLOOKUP(B9,'Lista Desplegable'!$A$49:$C$64,3,0))=TRUE,\"Seleccione el proceso Correcto\",VLOOKUP(B9,'Lista Desplegable'!$A$49:$C$64,3,0))","v":"Dirección Ejecutiva"},"Gestión Jurídica","Resolución","Interna",1,"Por la cual se adoptan disposiciones en relación con la publicidad de los actos administrativos de la RAPE","RAPE Región Central","Publicidad de los actos administrativos ","2014-09-30","Todos","VIGENTE","Ninguna"]
[{"$f":"IF(ISERROR(VLOOKUP(B10,'Lista Desplegable'!$A$49:$C$64,3,0))=TRUE,\"Seleccione el proceso Correcto\",VLOOKUP(B10,'Lista Desplegable'!$A$49:$C$64,3,0))","v":"Dirección Ejecutiva"},"Gestión Jurídica","Resolución","Interna",2,"Por medio de la cual se distribuyen los cargos de la planta global de la RAPE Región Central","RAPE Región Central","Distribución de los cargos de la planta global ","2015-03-13","Todos","VIGENTE","Ninguna"]
[{"$f":"IF(ISERROR(VLOOKUP(B11,'Lista Desplegable'!$A$49:$C$64,3,0))=TRUE,\"Seleccione el proceso Correcto\",VLOOKUP(B11,'Lista Desplegable'!$A$49:$C$64,3,0))","v":"Dirección Ejecutiva"},"Gestión Jurídica","Resolución","Interna",3,"Por la cual establece el Manual Específico de Funciones y de Competencias Laborales para los empleos de la planta de personal de la Región Administrativa y de Planeación Especial denominada RAPE – Región Central","RAPE Región Central","Manual Específico de Funciones y de Competencias Laborales","2015-03-13","Todos","VIGENTE","Ninguna"]
[{"$f":"IF(ISERROR(VLOOKUP(B12,'Lista Desplegable'!$A$49:$C$64,3,0))=TRUE,\"Seleccione el proceso Correcto\",VLOOKUP(B12,'Lista Desplegable'!$A$49:$C$64,3,0))","v":"Dirección Ejecutiva"},"Gestión Jurídica","Resolución","Interna",14,"Por la cual se adopta la tabla de honorarios para la contratación de servicios profesionales y de apoyo a la gestión de la Región Administrativa y de Planeación Especial RAPE- Región Central para la vigencia 2015","RAPE Región Central","Honorarios","2015-04-16","Todos","VIGENTE","Ninguna"]
[{"$f":"IF(ISERROR(VLOOKUP(B13,'Lista Desplegable'!$A$49:$C$64,3,0))=TRUE,\"Seleccione el proceso Correcto\",VLOOKUP(B13,'Lista Desplegable'!$A$49:$C$64,3,0))","v":"Dirección Ejecutiva"},"Gestión Jurídica","Resolución","Interna",16,"Por la cual se crea y reglamenta el funcionamiento del Comité de Contratación de la Región Administrativa y de Planeación especial RAPE - Región Central.","RAPE Región Central","Comité de Contratación","2015-04-20","Todos","VIGENTE","Ninguna"]
[{"$f":"IF(ISERROR(VLOOKUP(B14,'Lista Desplegable'!$A$49:$C$64,3,0))=TRUE,\"Seleccione el proceso Correcto\",VLOOKUP(B14,'Lista Desplegable'!$A$49:$C$64,3,0))","v":"Dirección Ejecutiva"},"Gestión Jurídica","Resolución","Interna",17,"Por la cual se designa el comité para la asesoría y evaluación de las prouestas presentadas, en los procesos de selección que adelanta la Dirección Corporativa de la Región Administrativa y de Planeacion Especial RAPE - Región Central.","RAPE Región Central","Comité para la asesoría y evaluación","2015-04-20","Todos","VIGENTE","Ninguna"]
[{"$f":"IF(ISERROR(VLOOKUP(B15,'Lista Desplegable'!$A$49:$C$64,3,0))=TRUE,\"Seleccione el proceso Correcto\",VLOOKUP(B15,'Lista Desplegable'!$A$49:$C$64,3,0))","v":"Dirección Ejecutiva"},"Gestión Jurídica","Resolución","Interna",19,"Por la cual se efectúa la distribución del presupuesto de Ingresos y Gastos de la Región Administrativa y de Planeación Especial - RAPE - Región Central, para la vigencia fiscal 2015 y se dictan otras disposiciones","RAPE Región Central","Distribución del presupuesto de Ingresos y Gastos","2015-04-22","Todos","VIGENTE","Ninguna"]
[{"$f":"IF(ISERROR(VLOOKUP(B16,'Lista Desplegable'!$A$49:$C$64,3,0))=TRUE,\"Seleccione el proceso Correcto\",VLOOKUP(B16,'Lista Desplegable'!$A$49:$C$64,3,0))","v":"Dirección Ejecutiva"},"Gestión Jurídica","Resolución","Interna",20,"Por la cual se constituye y se reglamenta el funcionamiento de la Caja Menor con cargo al presupuesto asignado a la RAPE para la vigencia fiscal 2015","RAPE Región Central","Caja menor","2015-04-23","Todos","VIGENTE","Ninguna"]
[{"$f":"IF(ISERROR(VLOOKUP(B17,'Lista Desplegable'!$A$49:$C$64,3,0))=TRUE,\"Seleccione el proceso Correcto\",VLOOKUP(B17,'Lista Desplegable'!$A$49:$C$64,3,0))","v":"Dirección Ejecutiva"},"Gestión Jurídica","Resolución","Interna",27,"Por medio de la cual se reglamenta el trámite de comisiones de servicio y el reconocimiento de viáticos y gastos de viaje en la RAPE – Región Central y se dictan otras disposiciones","RAPE Región Central","Comisiones de servicio y el reconocimiento de viáticos y gastos de viaje","2015-05-13","Todos","VIGENTE","Ninguna"]
[{"$f":"IF(ISERROR(VLOOKUP(B18,'Lista Desplegable'!$A$49:$C$64,3,0))=TRUE,\"Seleccione el proceso Correcto\",VLOOKUP(B18,'Lista Desplegable'!$A$49:$C$64,3,0))","v":"Dirección Ejecutiva"},"Gestión Jurídica","Resolución","Interna",30,"Por la cual se declara desierto el proceso de selección de Mínima Cuantía MC-001 DE 2015","RAPE Región Central","Contratación","2015-05-19","Todos","VIGENTE","Ninguna"]
[{"$f":"IF(ISERROR(VLOOKUP(B19,'Lista Desplegable'!$A$49:$C$64,3,0))=TRUE,\"Seleccione el proceso Correcto\",VLOOKUP(B19,'Lista Desplegable'!$A$49:$C$64,3,0))","v":"Dirección Ejecutiva"},"Gestión Jurídica","Resolución","Interna",31,"Por la cual se declara desierto el proceso de selección de Mínima Cuantía MC-002 DE 2015","RAPE Región Central","Contratación","2015-05-28","Todos","VIGENTE","Ninguna"]
[{"$f":"IF(ISERROR(VLOOKUP(B20,'Lista Desplegable'!$A$49:$C$64,3,0))=TRUE,\"Seleccione el proceso Correcto\",VLOOKUP(B20,'Lista Desplegable'!$A$49:$C$64,3,0))","v":"Dirección Ejecutiva"},"Gestión Jurídica","Resolución","Interna",34,"Por la cual se modifica la Resolución No. 019 de 20015","RAPE Región Central","Modificacíon Resolución","2015-06-12","Todos","VIGENTE","Ninguna"]
[{"$f":"IF(ISERROR(VLOOKUP(B21,'Lista Desplegable'!$A$49:$C$64,3,0))=TRUE,\"Seleccione el proceso Correcto\",VLOOKUP(B21,'Lista Desplegable'!$A$49:$C$64,3,0))","v":"Dirección Ejecutiva"},"Gestión Jurídica","Resolución","Interna",37,"Por la cual se ordena la Apertura del Proceso de Selección Abreviada de Menor Cuantía SAMC-003-2015","RAPE Región Central","Contratación","2015-06-22","Todos","VIGENTE","Ninguna"]
[{"$f":"IF(ISERROR(VLOOKUP(B22,'Lista Desplegable'!$A$49:$C$64,3,0))=TRUE,\"Seleccione el proceso Correcto\",VLOOKUP(B22,'Lista Desplegable'!$A$49:$C$64,3,0))","v":"Dirección Ejecutiva"},"Gestión Jurídica","Resolución","Interna",38,"Por la cual justifica la contratación de servicio de internet mediante pagos de servicios públicos","RAPE Región Central","Contratación","2015-06-23","Todos","VIGENTE","Ninguna"]
[{"$f":"IF(ISERROR(VLOOKUP(B23,'Lista Desplegable'!$A$49:$C$64,3,0))=TRUE,\"Seleccione el proceso Correcto\",VLOOKUP(B23,'Lista Desplegable'!$A$49:$C$64,3,0))","v":"Dirección Ejecutiva"},"Gestión Jurídica","Resolución","Interna",42,"Por medio de la cual se adjudica el proceso de Selección Abreviada Menor Cuantía No. SAMC-003-2015","RAPE Región Central","Contratación","2015-07-08","Todos","VIGENTE","Ninguna"]
[{"$f":"IF(ISERROR(VLOOKUP(B24,'Lista Desplegable'!$A$49:$C$64,3,0))=TRUE,\"Seleccione el proceso Correcto\",VLOOKUP(B24,'Lista Desplegable'!$A$49:$C$64,3,0))","v":"Dirección Ejecutiva"},"Gestión Jurídica","Resolución","Interna",44,"Por la cual se ordena la Apertura del Proceso de Selecció Abreviada de Menor Cuantía SAMC-006-2015","RAPE Región Central","Contratación","2015-07-13","Todos","VIGENTE","Ninguna"]
[{"$f":"IF(ISERROR(VLOOKUP(B25,'Lista Desplegable'!$A$49:$C$64,3,0))=TRUE,\"Seleccione el proceso Correcto\",VLOOKUP(B25,'Lista Desplegable'!$A$49:$C$64,3,0))","v":"Dirección Ejecutiva"},"Gestión Jurídica","Resolución","Interna",49,"Por la cual se convoca a elección de los representantes de los empleados ante la Comisión de Personal de la Región Administrativa y de Planeación Especial RAPE - Región Central","RAPE Región Central","Comisión de Personal de la Región","2015-07-21","Todos","VIGENTE","Ninguna"]
[{"$f":"IF(ISERROR(VLOOKUP(B26,'Lista Desplegable'!$A$49:$C$64,3,0))=TRUE,\"Seleccione el proceso Correcto\",VLOOKUP(B26,'Lista Desplegable'!$A$49:$C$64,3,0))","v":"Dirección Ejecutiva"},"Gestión Jurídica","Resolución","Interna",53,"Por medio de la cual se adjudica el proceso de Selección   Abreviada Menor Cuantía No. SAMC-006-2015","RAPE Región Central","Contratación","2015-07-28","Todos","VIGENTE","Ninguna"]
[{"$f":"IF(ISERROR(VLOOKUP(B27,'Lista Desplegable'!$A$49:$C$64,3,0))=TRUE,\"Seleccione el proceso Correcto\",VLOOKUP(B27,'Lista Desplegable'!$A$49:$C$64,3,0))","v":"Dirección Ejecutiva"},"Gestión Jurídica","Resolución","Interna",54,"Por la cual se realizan unos traslados en el Presupuesto Anual de Gastos e Inversiones de la Región Administrativa y de Planeación Especial denominada RAPE - Región Central para la vigencia fiscal de 2015","RAPE Región Central","Presupuesto de ingresos rentas y gastos ","2015-07-28","Todos","VIGENTE","Ninguna"]
[{"$f":"IF(ISERROR(VLOOKUP(B28,'Lista Desplegable'!$A$49:$C$64,3,0))=TRUE,\"Seleccione el proceso Correcto\",VLOOKUP(B28,'Lista Desplegable'!$A$49:$C$64,3,0))","v":"Dirección Ejecutiva"},"Gestión Jurídica","Resolución","Interna",55,"Por medio de la cual se reglamenta el trámite de autorización de desplazamiento a contratistas y el reconocimiento y pago de gastos de desplazamiento en la RAPE - Región Central","RAPE Región Central","Desplazamientos a contratistas","2015-07-28","Todos","VIGENTE","Ninguna"]
[{"$f":"IF(ISERROR(VLOOKUP(B29,'Lista Desplegable'!$A$49:$C$64,3,0))=TRUE,\"Seleccione el proceso Correcto\",VLOOKUP(B29,'Lista Desplegable'!$A$49:$C$64,3,0))","v":"Dirección Ejecutiva"},"Gestión Jurídica","Resolución","Interna",56,"Por la cual se establece el horario de trabajo de los empleados públicos de la RAPE - Región Central","RAPE Región Central","Horario de Trabajo","2015-07-31","Todos","VIGENTE","Ninguna"]
[{"$f":"IF(ISERROR(VLOOKUP(B30,'Lista Desplegable'!$A$49:$C$64,3,0))=TRUE,\"Seleccione el proceso Correcto\",VLOOKUP(B30,'Lista Desplegable'!$A$49:$C$64,3,0))","v":"Dirección Ejecutiva"},"Gestión Jurídica","Resolución","Interna",58,"Por la cual se realiza un traslado en el Presupuesto Anual de Gastos de la Región Administrativa y de Planeación Especial RAPE - Región Central para la vigencia fiscal de 2015","RAPE Región Central","Presupuesto de ingresos rentas y gastos ","2015-08-05","Todos","VIGENTE","Ninguna"]
{"$rows_left_out":363}
{"sheet":"Lista Desplegable","index":3,"n_rows":64,"n_cols":3,"rows_kept":64,"cut":false,"hidden":true,"merged":[]}
[]
["TIPO NORMA","TOTAL"]
["Constitución Política",{"$f":"COUNTIF('Resoluciones 2015'!$C$8:$C$65135,'Lista Desplegable'!A3)","v":0}]
["Ley ",{"$f":"COUNTIF('Resoluciones 2015'!$C$8:$C$65135,'Lista Desplegable'!A4)","v":0}]
["Decreto",{"$f":"COUNTIF('Resoluciones 2015'!$C$8:$C$65135,'Lista Desplegable'!A5)","v":0}]
["Decreto Ley",{"$f":"COUNTIF('Resoluciones 2015'!$C$8:$C$65135,'Lista Desplegable'!A6)","v":0}]
["Concepto",{"$f":"COUNTIF('Resoluciones 2015'!$C$8:$C$65135,'Lista Desplegable'!A7)","v":0}]
["Acuerdo",{"$f":"COUNTIF('Resoluciones 2015'!$C$8:$C$65135,'Lista Desplegable'!A8)","v":0}]
["Directiva",{"$f":"COUNTIF('Resoluciones 2015'!$C$8:$C$65135,'Lista Desplegable'!A9)","v":0}]
["Documento CONPES",{"$f":"COUNTIF('Resoluciones 2015'!$C$8:$C$65135,'Lista Desplegable'!A10)","v":0}]
["Reglamento",{"$f":"COUNTIF('Resoluciones 2015'!$C$8:$C$65135,'Lista Desplegable'!A11)","v":0}]
["Ordenanza",{"$f":"COUNTIF('Resoluciones 2015'!$C$8:$C$65135,'Lista Desplegable'!A12)","v":0}]
["Resolución",{"$f":"COUNTIF('Resoluciones 2015'!$C$8:$C$65135,'Lista Desplegable'!A13)","v":384}]
["Norma",{"$f":"COUNTIF('Resoluciones 2015'!$C$8:$C$65135,'Lista Desplegable'!A14)","v":0}]
["Guia",{"$f":"COUNTIF('Resoluciones 2015'!$C$8:$C$65135,'Lista Desplegable'!A15)","v":0}]
["Circular",{"$f":"COUNTIF('Resoluciones 2015'!$C$8:$C$65135,'Lista Desplegable'!A16)","v":0}]
["Convenio",{"$f":"COUNTIF('Resoluciones 2015'!$C$8:$C$65135,'Lista Desplegable'!A17)","v":0}]
["TOTAL",{"$f":"SUM(B3:B17)","v":384}]
[]
[]
["FUENTE","TOTAL"]
["Nacional",{"$f":"COUNTIF('Resoluciones 2015'!$D$48:$D$65135,'Lista Desplegable'!A22)","v":0}]
["Regional",{"$f":"COUNTIF('Resoluciones 2015'!$D$48:$D$65135,'Lista Desplegable'!A23)","v":0}]
["Departamental",{"$f":"COUNTIF('Resoluciones 2015'!$D$48:$D$65135,'Lista Desplegable'!A24)","v":0}]
["Municipal",{"$f":"COUNTIF('Resoluciones 2015'!$D$48:$D$65135,'Lista Desplegable'!A25)","v":0}]
["Distrital",{"$f":"COUNTIF('Resoluciones 2015'!$D$48:$D$65135,'Lista Desplegable'!A26)","v":0}]
["Técnica",{"$f":"COUNTIF('Resoluciones 2015'!$D$48:$D$65135,'Lista Desplegable'!A27)","v":0}]
["Interna",{"$f":"COUNTIF('Resoluciones 2015'!$D$48:$D$65135,'Lista Desplegable'!A28)","v":345}]
["Internacional",{"$f":"COUNTIF('Resoluciones 2015'!$D$48:$D$65135,'Lista Desplegable'!A29)","v":0}]
[null,{"$f":"COUNTIF('Resoluciones 2015'!$D$48:$D$65135,'Lista Desplegable'!A30)","v":0}]
{"$rows_left_out":35}
{"sheet":"cpr04","index":4,"n_rows":35,"n_cols":19,"rows_kept":35,"cut":false,"hidden":true,"merged":[[2,3,2,5],[5,1,5,2],[5,8,5,10],[5,12,5,14]]}
[]
[]
[null,null,null,"NORMOGRAMA",null,null,"11 de Julio de 2014"]
[]
[]
[null,"SERVICIO o PROCESO",null,null,null,null,null,null,"ORIGEN (marcar con \"X\")",null,null,null,"ESTADO (marcar con \"X\")"]
["ÁREA","CÓDIGO","NOMBRE","TIPO DE NORMA","NÚMERO DE IDENTIFICACIÓN","TÍTULO DEL DOCUMENTO","TEMA ESPECÍFICO","FECHA EXPEDICIÓN\n(DD/MM/AAAA)","Nacional","Distrital","Interno\nSDH","ARTÍCULOS","VIGENTE","DEROGADO PARCIALMENTE","DEROGADO TOTALMENTE","COMENTARIOS","Cambio Solicitado","Área Responsable","Fecha Cambio"]
["DGC","CPR-04","Calidad de Vida Laboral","Ley",9,"Por el cual se dictan medidas sanitarias","Código sanitario nacional","1979-01-24","X",null,null,null,"X",null,null,null,null,null,"N/A"]
["DGC","CPR-04","Calidad de Vida Laboral","Resolución",2400,"Estatuto de seguridad industrial",null,"1979-05-22","X",null,null,null,"X",null,null,null,null,null,"N/A"]
["DGC","CPR-04","Calidad de Vida Laboral","Decreto",614,"Por el cual se determinan las bases para la organización y administración de la salud ocupacional en el país ","bases para la administración de la salud ocupacional","1984-05-14","X",null,null,null,"X",null,null,null,null,null,"N/A"]
["DGC","CPR-04","Calidad de Vida Laboral","Resolución",2013,"Por el cual se reglamenta la organización y funcionamiento de los comités de medicina, higiene y seguridad en los lugares de trabajo","Reglamenta la organización y funcionamiento de los COPASOS en los lugares de trabajo","1986-06-06","X",null,null,null,"X",null,null,null,null,null,"N/A"]
["DGC","CPR-04","Calidad de Vida Laboral","Resolución",1016,"Por la cual se reglamenta la organización, funcionamiento y forma de los programas de salud ocupacional que deban desarrollar los patronos o empleadores en el país ","Reglamenta la organización, funcionamiento y forma de los programas de salud ocupacional","1989-03-31","X",null,null,null,"X",null,null,null,null,null,"N/A"]
["DGC","CPR-04","Calidad de Vida Laboral","Decreto",2177,"Por el cual se desarrolla la Ley  82 de 1988, aprobatoria del convenio número 159, con la organización internacional  el trabajo, sobre readaptación  profesional y el empleo de personas invalidas","Readaptación profesional","1989-09-21","X",null,null,null,"X",null,null,null,null,null,"N/A"]
["DGC","CPR-04","Calidad de Vida Laboral","Ley",100,"Por el cual se crea el sistema e seguridad social integral y se dictan  otras disposiciones","Sistema general de seguridad social en Colombia","1993-12-23","X",null,null,null,"X",null,null,null,null,null,"N/A"]
["DGC","CPR-04","Calidad de Vida Laboral","Decreto",1295,"Por el cual se determina la organización  y administración el sistema general  de riesgos profesionales","organización y administración del sistema general e riesgos profesionales","1994-06-22","X",null,null,null,"X",null,null,null,null,null,"N/A"]
["DGC","CPR-04","Calidad de Vida Laboral","Decreto",1772,"Por el cual se reglamenta la afiliación  y las cotizaciones al sistema general de riesgos profesionales","Reglamentación, afiliación y cotización al sistema general e riesgos profesionales","1994-08-03","X",null,null,null,"X",null,null,null,null,null,"N/A"]
["DGC","CPR-04","Calidad de Vida Laboral","Decreto",1832,"Por el cual se adopta la tabla de enfermedades profesionales","Adopta la tabla de enfermedades profesionales","1994-08-03","X",null,null,null,"X",null,null,null,null,null,"N/A"]
["DGC","CPR-04","Calidad de Vida Laboral","Decreto",1530,"Por el cual se reglamenta  la Ley 100 de 1993 y el decreto Ley 1295 de 1994","Se reglamenta la Ley 100 de 1993","1996-08-26","X",null,null,null,"X",null,null,null,null,null,"N/A"]
["DGC","CPR-04","Calidad de Vida Laboral","Ley",378,"Por medio de la cual se aprueba el \"convenio 161 sobre los servicios de salud  en el trabajo\"  adoptado por la 71 reunión de la conferencia general  de la Organización Internacional  del trabajo. OIT, Ginebra, 1985","Convenio 161 sobre los servicios de la salud en el trabajo","1997-07-09","X",null,null,null,"X",null,null,null,null,null,"N/A"]
["DGC","CPR-04","Calidad de Vida Laboral","Decreto - Ley",1567,"Por el cual se crea el sistema nacional  de capacitación y el sistema de estímulos para los empleados del estado","Sistema nacional de estímulos y capacitación","1998-08-05","X",null,null,null,"X",null,null,null,null,null,"N/A"]
["DGC","CPR-04","Calidad de Vida Laboral","Decreto",917,"Por el cual se modifica el decreto 692 de 1995","Manual único para la calificación de la Invalidez","1999-05-28","X",null,null,null,"X",null,null,null,null,null,"N/A"]
["DGC","CPR-04","Calidad de Vida Laboral","Decreto",2463,"Por el cual se reglamenta la integración, financiación y funcionamiento de las juntas de calificación de invalidez","Juntas de calificación de invalidez","2001-11-20","X",null,null,null,"X",null,null,null,null,null,"N/A"]
["DGC","CPR-04","Calidad de Vida Laboral","Ley",776,"Por el cual se dictan normas sobre la organización, administración y prestaciones del sistema general de riesgos profesionales","Organización sistema general de riesgos profesionales","2002-12-17","X",null,null,null,"X",null,null,null,null,null,"N/A"]
["DGC","CPR-04","Calidad de Vida Laboral","Resolución",185,"Por el cual se reglamenta el sistema de capacitación interna de la Secretaría Distrital de Hacienda","reglamentación  del sistema de capacitación e la Secretaría Distrital de Hacienda","2007",null,null,"X",null,"X",null,null,null,null,null,"N/A"]
["DGC","CPR-04","Calidad de Vida Laboral","Decreto",2800,"Por el se reglamenta la afiliación y cotización de los trabajadores independientes a riesgos profesionales","cotización de trabajadores independientes a riesgos profesionales","2003","X",null,null,null,"X",null,null,null,null,null,"N/A"]
["DGC","CPR-04","Calidad de Vida Laboral","Ley",909,"Por la cual se expiden normas que regulan el empleo público, la carrera administrativa, gerencia pública y se dictan otras disposiciones","Ley de carrera administrativa","2004-09-23","X",null,null,null,"X",null,null,null,null,null,"N/A"]
["DGC","CPR-04","Calidad de Vida Laboral","Circular","Unificada","Unifica las instrucciones para la vigilancia, control y administración del sistema general de riesgos profesionales.","Instrucciones a empleadores y ARP","2004-04-22","X",null,null,null,"X",null,null,null,null,null,"N/A"]
["DGC","CPR-04","Calidad de Vida Laboral","Circular",5,"Formación en puestos de trabajo",null,"2005","X",null,null,null,"X",null,null,null,null,null,"N/A"]
["DGC","CPR-04","Calidad de Vida Laboral","Circular",8,"Formación en puestos de trabajo",null,"2005","X",null,null,null,"X",null,null,null,null,null,"N/A"]
["DGC","CPR-04","Calidad de Vida Laboral","Ley",1010,"Por medio de la cual se adoptan medidas para prevenir, corregir y sancionar el acoso laboral y otros hostigamientos en el marco de las relaciones de trabajo","Mecanismos de prevención de situaciones de Acoso laboral","2006-01-23","X",null,null,null,"X",null,null,null,null,null,"N/A"]
{"$rows_left_out":6}
{"sheet":"CONTROL DE CAMBIOS","index":5,"n_rows":5,"n_cols":7,"rows_kept":5,"cut":false,"hidden":true,"merged":[]}
[]
[null,null,"CONTROL DE CAMBIOS"]
[]
[]
[null,"Código del Proceso","Nombre del Proceso","Fecha de solicitud del cambio","Cambio solicitado","Documento soporte","Área Responsable"]